Summary:ASTERISK-14584: Skype Make error
Reporter:Matteo (mpiazzatnetbug)Labels:
Date Opened:2009-08-03 07:27:27Date Closed:2011-06-07 14:00:55
Versions:Frequency of
Description:sargas:/usr/src/skypeforasterisk-1.4_0.9.11-x86_32# make
gcc -o chan_skype.o -c chan_skype.c -pipe -fPIC -DAST_MODULE=\"chan_skype\" -MD -MT chan_skype.o -MF .chan_skype.o.d -MP
chan_skype.c:209: error: unknown field âduplicateâ specified in initializer
chan_skype.c:209: warning: excess elements in struct initializer
chan_skype.c:209: warning: (near initialization for âskype_call_datastoreâ)
chan_skype.c: In function âindicateâ:
chan_skype.c:394: error: âAST_CONTROL_SRCUPDATEâ undeclared (first use in this function)
chan_skype.c:394: error: (Each undeclared identifier is reported only once
chan_skype.c:394: error: for each function it appears in.)
chan_skype.c: In function âskype_datastore_writeâ:
chan_skype.c:2174: error: âstruct ast_datastoreâ has no member named âinheritanceâ
chan_skype.c:2174: error: âDATASTORE_INHERIT_FOREVERâ undeclared (first use in this function)
make: *** [chan_skype.o] Error 1
Comments:By: Matteo (mpiazzatnetbug) 2009-08-03 07:33:06

Sorry, I see only now:
Beta Testing
As an SFA beta tester, you have received an SFA product package as either an
RPM to be installed on AsteriskNOW 1.5 or as a tar-file that can be used to
install SFA on any 32-bit or 64-bit Linux system with Asterisk 1.4 (version
1.4.25 or higher) already installed.